BDBM279732 US10035804, Example 3
SMILES CC(C)n1cc(cn1)C(=O)N1CC2(C1)CN(C2)c1cncc(c1)N1C(=O)c2ccc(Cl)cc2C1(C)C
InChI Key InChIKey=CRYMCWBIMHHTAO-UHFFFAOYSA-N
Data  2 EC50
  Tab Delimited (TSV)   2D SDfile   Computed 3D by Vconf -m prep SDfile
Find this compound or compounds like it in BindingDB:
Activity Spreadsheet -- Enzyme Inhibition Constant Data from BindingDB
Found 1 hit for monomerid = 279732
TargetCytochrome P450 11B2, mitochondrial(Homo sapiens (Human))
Hoffmann-La Roche
US Patent
LigandPNGBDBM279732(US10035804, Example 3)
Affinity DataEC50:  0.00800nM. Assay description: Herein we identified the use of the G-402 cell line as a host cell to ectopically express (transiently or stably) enzymes of the CYP11 family. Specif...
Ligand InfoPC cidPC sid
In DepthDetails US Patent